{"text_format":"2","workbook":"xlsx","n_sheets":6,"sheets":["菜单","缩略词","学校角色","审核角色","双向细目表角色","枚举"],"not_rendered":{"charts":0,"images":0,"macros":0,"external_links":0,"defined_names":1,"comments":0,"pivot_tables":0},"unopened":[],"bounds":{"document_bytes":16777216,"sheet_cells":100000,"run_cost":"one","rows_first":2000,"rows_last":500,"rows_between":2000,"halvings":0,"cell_chars":16384,"cell_head_chars":4096},"cells_cut":0,"cells_raw":0,"read":"whole","date_system":"1900"}

{"sheet":"菜单","index":0,"n_rows":203,"n_cols":22,"rows_kept":203,"cut":false,"hidden":false,"merged":[]}
["Id","Pid","Pids","Name","FullName","Code","Type","TypeV","Icon","Router","Component","Permission","OpenType","OpenTypeV","Visible",null,"Sort","Status","StatusV","C# Code","AuthCode","/** 菜单生成SQL */"]
[10000000,0,{"$f":"\"[\"&B2&\"],\"","v":"[0],"},"工作台",{"$f":"D2","v":"工作台"},"wb","MenuType.MENU",{"$f":"VLOOKUP(G2,枚举!A:B,2,FALSE)","v":2},"home",{"$f":"\"/\"&F2","v":"/wb"},null,null,"MenuOpenType.COMPONENT",{"$f":"VLOOKUP(M2,枚举!D:E,2,FALSE)","v":2},"true",1,{"$f":"A2","v":10000000},"CommonStatus.ENABLE",1,{"$f":"\"            new SysMenu { Id = \"&A2&\", Pid = \"&B2&\", Pids = \"\"\"&C2&\"\"\", Name = \"\"\"&D2&\"\"\", Code = \"\"\"&F2&\"\"\", MenuType = \"&G2&\", Icon = \"\"\"&I2&\"\"\", Router = \"\"\"&J2&\"\"\", Component = \"\"\"&K2&\"\"\", Permission = \"\"\"&L2&\"\"\", OpenType = \"&M2&\", Visible = \"&O2&\", Sort = \"&Q2&\", Status = \"&R2&\" },\"","v":"            new SysMenu { Id = 10000000, Pid = 0, Pids = \"[0],\", Name = \"工作台\", Code = \"wb\", MenuType = MenuType.MENU, Icon = \"home\", Router = \"/wb\", Component = \"\", Permission = \"\", OpenType = MenuOpenType.COMPONENT, Visible = true, Sort = 10000000, Status = CommonStatus.ENABLE },"},{"$f":"UPPER(SUBSTITUTE(SUBSTITUTE(L2,\"-\",\"_\"),\".\",\"_\"))","v":""},{"$f":"\"INSERT INTO sys_menu(id, pid, pids, `name`, `code`, menu_type, icon, router, permission, open_type, visible, sort, `status`) VALUES(\"&A2&\", \"&B2&\", '\"&C2&\"', '\"&D2&\"', '\"&F2&\"', \"&H2&\", '\"&I2&\"', '\"&J2&\"', '\"&L2&\"', \"&N2&\", \"&P2&\", \"&Q2&\", \"&S2&\");\"","v":"INSERT INTO sys_menu(id, pid, pids, `name`, `code`, menu_type, icon, router, permission, open_type, visible, sort, `status`) VALUES(10000000, 0, '[0],', '工作台', 'wb', 2, 'home', '/wb', '', 2, 1, 10000000, 1);"}]
[]
[]
[10010000,0,{"$f":"\"[\"&B5&\"],\"","v":"[0],"},"基础资料",{"$f":"D5","v":"基础资料"},"base-s","MenuType.FOLDER",{"$f":"VLOOKUP(G5,枚举!A:B,2,FALSE)","v":1},"apps",{"$f":"\"/\"&F5","v":"/base-s"},null,null,"MenuOpenType.NONE",{"$f":"VLOOKUP(M5,枚举!D:E,2,FALSE)","v":1},"false",0,{"$f":"A5","v":10010000},"CommonStatus.ENABLE",1,{"$f":"\"            new SysMenu { Id = \"&A5&\", Pid = \"&B5&\", Pids = \"\"\"&C5&\"\"\", Name = \"\"\"&D5&\"\"\", Code = \"\"\"&F5&\"\"\", MenuType = \"&G5&\", Icon = \"\"\"&I5&\"\"\", Router = \"\"\"&J5&\"\"\", Component = \"\"\"&K5&\"\"\", Permission = \"\"\"&L5&\"\"\", OpenType = \"&M5&\", Visible = \"&O5&\", Sort = \"&Q5&\", Status = \"&R5&\" },\"","v":"            new SysMenu { Id = 10010000, Pid = 0, Pids = \"[0],\", Name = \"基础资料\", Code = \"base-s\", MenuType = MenuType.FOLDER, Icon = \"apps\", Router = \"/base-s\", Component = \"\", Permission = \"\", OpenType = MenuOpenType.NONE, Visible = false, Sort = 10010000, Status = CommonStatus.ENABLE },"},{"$f":"UPPER(SUBSTITUTE(SUBSTITUTE(L5,\"-\",\"_\"),\".\",\"_\"))","v":""},{"$f":"\"INSERT INTO sys_menu(id, pid, pids, `name`, `code`, menu_type, icon, router, permission, open_type, visible, sort, `status`) VALUES(\"&A5&\", \"&B5&\", '\"&C5&\"', '\"&D5&\"', '\"&F5&\"', \"&H5&\", '\"&I5&\"', '\"&J5&\"', '\"&L5&\"', \"&N5&\", \"&P5&\", \"&Q5&\", \"&S5&\");\"","v":"INSERT INTO sys_menu(id, pid, pids, `name`, `code`, menu_type, icon, router, permission, open_type, visible, sort, `status`) VALUES(10010000, 0, '[0],', '基础资料', 'base-s', 1, 'apps', '/base-s', '', 1, 0, 10010000, 1);"}]
[10010100,{"$f":"A$5","v":10010000},{"$f":"C$5&\"[\"&B6&\"],\"","v":"[0],[10010000],"},"班级信息",{"$f":"E$5&\"/\"&D6","v":"基础资料/班级信息"},"class","MenuType.MENU",{"$f":"VLOOKUP(G6,枚举!A:B,2,FALSE)","v":2},null,{"$f":"J$5&\"/\"&F6","v":"/base-s/class"},null,null,"MenuOpenType.COMPONENT",{"$f":"VLOOKUP(M6,枚举!D:E,2,FALSE)","v":2},"true",1,10,"CommonStatus.ENABLE",1,{"$f":"\"            new SysMenu { Id = \"&A6&\", Pid = \"&B6&\", Pids = \"\"\"&C6&\"\"\", Name = \"\"\"&D6&\"\"\", Code = \"\"\"&F6&\"\"\", MenuType = \"&G6&\", Icon = \"\"\"&I6&\"\"\", Router = \"\"\"&J6&\"\"\", Component = \"\"\"&K6&\"\"\", Permission = \"\"\"&L6&\"\"\", OpenType = \"&M6&\", Visible = \"&O6&\", Sort = \"&Q6&\", Status = \"&R6&\" },\"","v":"            new SysMenu { Id = 10010100, Pid = 10010000, Pids = \"[0],[10010000],\", Name = \"班级信息\", Code = \"class\", MenuType = MenuType.MENU, Icon = \"\", Router = \"/base-s/class\", Component = \"\", Permission = \"\", OpenType = MenuOpenType.COMPONENT, Visible = true, Sort = 10, Status = CommonStatus.ENABLE },"},{"$f":"UPPER(SUBSTITUTE(SUBSTITUTE(L6,\"-\",\"_\"),\".\",\"_\"))","v":""},"INSERT INTO sys_menu(id, pid, pids, `name`, `code`, menu_type, icon, router, permission, open_type, visible, sort, `status`) VALUES(10010100, 10010000, '[0],[10010000],', '班级信息', 'class', 2, '', '/base-s/class', '', 2, 1, 10, 1);"]
[10010101,{"$f":"A$6","v":10010100},{"$f":"C$6&\"[\"&B7&\"],\"","v":"[0],[10010000],[10010100],"},"添加",{"$f":"E$6&\"/\"&D7","v":"基础资料/班级信息/添加"},"add","MenuType.BUTTON",{"$f":"VLOOKUP(G7,枚举!A:B,2,FALSE)","v":3},null,null,null,{"$f":"F$5&\".\"&F$6&\".\"&F7","v":"base-s.class.add"},"MenuOpenType.NONE",{"$f":"VLOOKUP(M7,枚举!D:E,2,FALSE)","v":1},"true",1,0,"CommonStatus.ENABLE",1,"            new SysMenu { Id = 10010101, Pid = 10010100, Pids = \"[0],[10010000],[10010100],\", Name = \"添加\", Code = \"add\", MenuType = MenuType.BUTTON, Icon = \"\", Router = \"\", Component = \"\", Permission = \"base-s.class.add\", OpenType = MenuOpenType.NONE, Visible = true, Sort = 0, Status = CommonStatus.ENABLE },",{"$f":"UPPER(SUBSTITUTE(SUBSTITUTE(L7,\"-\",\"_\"),\".\",\"_\"))","v":"BASE_S_CLASS_ADD"},"INSERT INTO sys_menu(id, pid, pids, `name`, `code`, menu_type, icon, router, permission, open_type, visible, sort, `status`) VALUES(10010101, 10010100, '[0],[10010000],[10010100],', '添加', 'add', 3, '', '', 'base-s.class.add', 1, 1, 0, 1);"]
[10010102,{"$f":"A$6","v":10010100},{"$f":"C$6&\"[\"&B8&\"],\"","v":"[0],[10010000],[10010100],"},"修改",{"$f":"E$6&\"/\"&D8","v":"基础资料/班级信息/修改"},"edit","MenuType.BUTTON",{"$f":"VLOOKUP(G8,枚举!A:B,2,FALSE)","v":3},null,null,null,{"$f":"F$5&\".\"&F$6&\".\"&F8","v":"base-s.class.edit"},"MenuOpenType.NONE",{"$f":"VLOOKUP(M8,枚举!D:E,2,FALSE)","v":1},"true",1,0,"CommonStatus.ENABLE",1,"            new SysMenu { Id = 10010102, Pid = 10010100, Pids = \"[0],[10010000],[10010100],\", Name = \"修改\", Code = \"edit\", MenuType = MenuType.BUTTON, Icon = \"\", Router = \"\", Component = \"\", Permission = \"base-s.class.edit\", OpenType = MenuOpenType.NONE, Visible = true, Sort = 0, Status = CommonStatus.ENABLE },",{"$f":"UPPER(SUBSTITUTE(SUBSTITUTE(L8,\"-\",\"_\"),\".\",\"_\"))","v":"BASE_S_CLASS_EDIT"},"INSERT INTO sys_menu(id, pid, pids, `name`, `code`, menu_type, icon, router, permission, open_type, visible, sort, `status`) VALUES(10010102, 10010100, '[0],[10010000],[10010100],', '修改', 'edit', 3, '', '', 'base-s.class.edit', 1, 1, 0, 1);"]
[10010103,{"$f":"A$6","v":10010100},{"$f":"C$6&\"[\"&B9&\"],\"","v":"[0],[10010000],[10010100],"},"删除",{"$f":"E$6&\"/\"&D9","v":"基础资料/班级信息/删除"},"del","MenuType.BUTTON",{"$f":"VLOOKUP(G9,枚举!A:B,2,FALSE)","v":3},null,null,null,{"$f":"F$5&\".\"&F$6&\".\"&F9","v":"base-s.class.del"},"MenuOpenType.NONE",{"$f":"VLOOKUP(M9,枚举!D:E,2,FALSE)","v":1},"true",1,0,"CommonStatus.ENABLE",1,"            new SysMenu { Id = 10010103, Pid = 10010100, Pids = \"[0],[10010000],[10010100],\", Name = \"删除\", Code = \"del\", MenuType = MenuType.BUTTON, Icon = \"\", Router = \"\", Component = \"\", Permission = \"base-s.class.del\", OpenType = MenuOpenType.NONE, Visible = true, Sort = 0, Status = CommonStatus.ENABLE },",{"$f":"UPPER(SUBSTITUTE(SUBSTITUTE(L9,\"-\",\"_\"),\".\",\"_\"))","v":"BASE_S_CLASS_DEL"},"INSERT INTO sys_menu(id, pid, pids, `name`, `code`, menu_type, icon, router, permission, open_type, visible, sort, `status`) VALUES(10010103, 10010100, '[0],[10010000],[10010100],', '删除', 'del', 3, '', '', 'base-s.class.del', 1, 1, 0, 1);"]
[10010200,{"$f":"A$5","v":10010000},{"$f":"C$5&\"[\"&B10&\"],\"","v":"[0],[10010000],"},"学生信息",{"$f":"E$5&\"/\"&D10","v":"基础资料/学生信息"},"student","MenuType.MENU",{"$f":"VLOOKUP(G10,枚举!A:B,2,FALSE)","v":2},null,{"$f":"J$5&\"/\"&F10","v":"/base-s/student"},null,null,"MenuOpenType.COMPONENT",{"$f":"VLOOKUP(M10,枚举!D:E,2,FALSE)","v":2},"true",1,20,"CommonStatus.ENABLE",1,"            new SysMenu { Id = 10010200, Pid = 10010000, Pids = \"[0],[10010000],\", Name = \"学生信息\", Code = \"student\", MenuType = MenuType.MENU, Icon = \"\", Router = \"/base-s/student\", Component = \"\", Permission = \"\", OpenType = MenuOpenType.COMPONENT, Visible = true, Sort = 20, Status = CommonStatus.ENABLE },","",{"$f":"\"INSERT INTO sys_menu(id, pid, pids, `name`, `code`, menu_type, icon, router, permission, open_type, visible, sort, `status`) VALUES(\"&A10&\", \"&B10&\", '\"&C10&\"', '\"&D10&\"', '\"&F10&\"', \"&H10&\", '\"&I10&\"', '\"&J10&\"', '\"&L10&\"', \"&N10&\", \"&P10&\", \"&Q10&\", \"&S10&\");\"","v":"INSERT INTO sys_menu(id, pid, pids, `name`, `code`, menu_type, icon, router, permission, open_type, visible, sort, `status`) VALUES(10010200, 10010000, '[0],[10010000],', '学生信息', 'student', 2, '', '/base-s/student', '', 2, 1, 20, 1);"}]
[10010201,{"$f":"A$10","v":10010200},{"$f":"C$10&\"[\"&B11&\"],\"","v":"[0],[10010000],[10010200],"},"添加",{"$f":"E$10&\"/\"&D11","v":"基础资料/学生信息/添加"},"add","MenuType.BUTTON",{"$f":"VLOOKUP(G11,枚举!A:B,2,FALSE)","v":3},null,null,null,{"$f":"F$5&\".\"&F$10&\".\"&F11","v":"base-s.student.add"},"MenuOpenType.NONE",{"$f":"VLOOKUP(M11,枚举!D:E,2,FALSE)","v":1},"true",1,0,"CommonStatus.ENABLE",1,"            new SysMenu { Id = 10010201, Pid = 10010200, Pids = \"[0],[10010000],[10010200],\", Name = \"添加\", Code = \"add\", MenuType = MenuType.BUTTON, Icon = \"\", Router = \"\", Component = \"\", Permission = \"base-s.student.add\", OpenType = MenuOpenType.NONE, Visible = true, Sort = 0, Status = CommonStatus.ENABLE },","BASE_S_STUDENT_ADD","INSERT INTO sys_menu(id, pid, pids, `name`, `code`, menu_type, icon, router, permission, open_type, visible, sort, `status`) VALUES(10010201, 10010200, '[0],[10010000],[10010200],', '添加', 'add', 3, '', '', 'base-s.student.add', 1, 1, 0, 1);"]
[10010202,{"$f":"A$10","v":10010200},{"$f":"C$10&\"[\"&B12&\"],\"","v":"[0],[10010000],[10010200],"},"修改",{"$f":"E$10&\"/\"&D12","v":"基础资料/学生信息/修改"},"edit","MenuType.BUTTON",{"$f":"VLOOKUP(G12,枚举!A:B,2,FALSE)","v":3},null,null,null,{"$f":"F$5&\".\"&F$10&\".\"&F12","v":"base-s.student.edit"},"MenuOpenType.NONE",{"$f":"VLOOKUP(M12,枚举!D:E,2,FALSE)","v":1},"true",1,0,"CommonStatus.ENABLE",1,"            new SysMenu { Id = 10010202, Pid = 10010200, Pids = \"[0],[10010000],[10010200],\", Name = \"修改\", Code = \"edit\", MenuType = MenuType.BUTTON, Icon = \"\", Router = \"\", Component = \"\", Permission = \"base-s.student.edit\", OpenType = MenuOpenType.NONE, Visible = true, Sort = 0, Status = CommonStatus.ENABLE },","BASE_S_STUDENT_EDIT","INSERT INTO sys_menu(id, pid, pids, `name`, `code`, menu_type, icon, router, permission, open_type, visible, sort, `status`) VALUES(10010202, 10010200, '[0],[10010000],[10010200],', '修改', 'edit', 3, '', '', 'base-s.student.edit', 1, 1, 0, 1);"]
[10010203,{"$f":"A$10","v":10010200},{"$f":"C$10&\"[\"&B13&\"],\"","v":"[0],[10010000],[10010200],"},"删除",{"$f":"E$10&\"/\"&D13","v":"基础资料/学生信息/删除"},"del","MenuType.BUTTON",{"$f":"VLOOKUP(G13,枚举!A:B,2,FALSE)","v":3},null,null,null,{"$f":"F$5&\".\"&F$10&\".\"&F13","v":"base-s.student.del"},"MenuOpenType.NONE",{"$f":"VLOOKUP(M13,枚举!D:E,2,FALSE)","v":1},"true",1,0,"CommonStatus.ENABLE",1,"            new SysMenu { Id = 10010203, Pid = 10010200, Pids = \"[0],[10010000],[10010200],\", Name = \"删除\", Code = \"del\", MenuType = MenuType.BUTTON, Icon = \"\", Router = \"\", Component = \"\", Permission = \"base-s.student.del\", OpenType = MenuOpenType.NONE, Visible = true, Sort = 0, Status = CommonStatus.ENABLE },","BASE_S_STUDENT_DEL","INSERT INTO sys_menu(id, pid, pids, `name`, `code`, menu_type, icon, router, permission, open_type, visible, sort, `status`) VALUES(10010203, 10010200, '[0],[10010000],[10010200],', '删除', 'del', 3, '', '', 'base-s.student.del', 1, 1, 0, 1);"]
[10010300,{"$f":"A$5","v":10010000},{"$f":"C$5&\"[\"&B14&\"],\"","v":"[0],[10010000],"},"教师信息",{"$f":"E$5&\"/\"&D14","v":"基础资料/教师信息"},"teacher","MenuType.MENU",{"$f":"VLOOKUP(G14,枚举!A:B,2,FALSE)","v":2},null,{"$f":"J$5&\"/\"&F14","v":"/base-s/teacher"},null,null,"MenuOpenType.COMPONENT",{"$f":"VLOOKUP(M14,枚举!D:E,2,FALSE)","v":2},"true",1,30,"CommonStatus.ENABLE",1,"            new SysMenu { Id = 10010300, Pid = 10010000, Pids = \"[0],[10010000],\", Name = \"教师信息\", Code = \"teacher\", MenuType = MenuType.MENU, Icon = \"\", Router = \"/base-s/teacher\", Component = \"\", Permission = \"\", OpenType = MenuOpenType.COMPONENT, Visible = true, Sort = 30, Status = CommonStatus.ENABLE },","",{"$f":"\"INSERT INTO sys_menu(id, pid, pids, `name`, `code`, menu_type, icon, router, permission, open_type, visible, sort, `status`) VALUES(\"&A14&\", \"&B14&\", '\"&C14&\"', '\"&D14&\"', '\"&F14&\"', \"&H14&\", '\"&I14&\"', '\"&J14&\"', '\"&L14&\"', \"&N14&\", \"&P14&\", \"&Q14&\", \"&S14&\");\"","v":"INSERT INTO sys_menu(id, pid, pids, `name`, `code`, menu_type, icon, router, permission, open_type, visible, sort, `status`) VALUES(10010300, 10010000, '[0],[10010000],', '教师信息', 'teacher', 2, '', '/base-s/teacher', '', 2, 1, 30, 1);"}]
[10010301,{"$f":"A$14","v":10010300},{"$f":"C$14&\"[\"&B15&\"],\"","v":"[0],[10010000],[10010300],"},"添加",{"$f":"E$14&\"/\"&D15","v":"基础资料/教师信息/添加"},"add","MenuType.BUTTON",{"$f":"VLOOKUP(G15,枚举!A:B,2,FALSE)","v":3},null,null,null,{"$f":"F$5&\".\"&F$14&\".\"&F15","v":"base-s.teacher.add"},"MenuOpenType.NONE",{"$f":"VLOOKUP(M15,枚举!D:E,2,FALSE)","v":1},"true",1,0,"CommonStatus.ENABLE",1,"            new SysMenu { Id = 10010301, Pid = 10010300, Pids = \"[0],[10010000],[10010300],\", Name = \"添加\", Code = \"add\", MenuType = MenuType.BUTTON, Icon = \"\", Router = \"\", Component = \"\", Permission = \"base-s.teacher.add\", OpenType = MenuOpenType.NONE, Visible = true, Sort = 0, Status = CommonStatus.ENABLE },","BASE_S_TEACHER_ADD","INSERT INTO sys_menu(id, pid, pids, `name`, `code`, menu_type, icon, router, permission, open_type, visible, sort, `status`) VALUES(10010301, 10010300, '[0],[10010000],[10010300],', '添加', 'add', 3, '', '', 'base-s.teacher.add', 1, 1, 0, 1);"]
{"$rows_left_out":189}
{"sheet":"缩略词","index":1,"n_rows":22,"n_cols":3,"rows_kept":22,"cut":false,"hidden":false,"merged":[]}
["名词","名称","缩写"]
[null,"purchase","pur"]
[null,"manufacture","mf"]
[null,"quality","qa"]
[null,"warehouse","wh"]
[null,"warehouse place","wh-p"]
[null,"warehouse place group","wh-pg"]
[null,"customer","cust"]
[null,"supplier","sup"]
[null,"unit group","ug"]
[null,"work type","wt"]
[null,"k3 dept","kdept"]
[null,"k3 sync","ksync"]
[null,"workbench","wb"]
[null,"transfer check","tcheck"]
{"$rows_left_out":8}
{"sheet":"学校角色","index":2,"n_rows":123,"n_cols":4,"rows_kept":123,"cut":false,"hidden":false,"merged":[]}
["sys_role_id","sys_menu_id","sys_menu_name","/* 学校管理员角色菜单权限 */"]
[6,{"$f":"菜单!A2","v":10000000},{"$f":"菜单!E2","v":"工作台"},{"$f":"\"INSERT INTO sys_role_menu(sys_role_id, sys_menu_id, data_scope_type) VALUES(\"&A2&\", \"&B2&\", 0);\"","v":"INSERT INTO sys_role_menu(sys_role_id, sys_menu_id, data_scope_type) VALUES(6, 10000000, 0);"}]
[6,{"$f":"菜单!A5","v":10010000},{"$f":"菜单!E5","v":"基础资料"},{"$f":"\"INSERT INTO sys_role_menu(sys_role_id, sys_menu_id, data_scope_type) VALUES(\"&A3&\", \"&B3&\", 0);\"","v":"INSERT INTO sys_role_menu(sys_role_id, sys_menu_id, data_scope_type) VALUES(6, 10010000, 0);"}]
[6,{"$f":"菜单!A6","v":10010100},{"$f":"菜单!E6","v":"基础资料/班级信息"},"INSERT INTO sys_role_menu(sys_role_id, sys_menu_id, data_scope_type) VALUES(6, 10010100, 0);"]
[6,{"$f":"菜单!A7","v":10010101},{"$f":"菜单!E7","v":"基础资料/班级信息/添加"},"INSERT INTO sys_role_menu(sys_role_id, sys_menu_id, data_scope_type) VALUES(6, 10010101, 0);"]
[6,{"$f":"菜单!A8","v":10010102},{"$f":"菜单!E8","v":"基础资料/班级信息/修改"},"INSERT INTO sys_role_menu(sys_role_id, sys_menu_id, data_scope_type) VALUES(6, 10010102, 0);"]
[6,{"$f":"菜单!A9","v":10010103},{"$f":"菜单!E9","v":"基础资料/班级信息/删除"},"INSERT INTO sys_role_menu(sys_role_id, sys_menu_id, data_scope_type) VALUES(6, 10010103, 0);"]
[6,{"$f":"菜单!A10","v":10010200},{"$f":"菜单!E10","v":"基础资料/学生信息"},"INSERT INTO sys_role_menu(sys_role_id, sys_menu_id, data_scope_type) VALUES(6, 10010200, 0);"]
[6,{"$f":"菜单!A11","v":10010201},{"$f":"菜单!E11","v":"基础资料/学生信息/添加"},"INSERT INTO sys_role_menu(sys_role_id, sys_menu_id, data_scope_type) VALUES(6, 10010201, 0);"]
[6,{"$f":"菜单!A12","v":10010202},{"$f":"菜单!E12","v":"基础资料/学生信息/修改"},"INSERT INTO sys_role_menu(sys_role_id, sys_menu_id, data_scope_type) VALUES(6, 10010202, 0);"]
[6,{"$f":"菜单!A13","v":10010203},{"$f":"菜单!E13","v":"基础资料/学生信息/删除"},"INSERT INTO sys_role_menu(sys_role_id, sys_menu_id, data_scope_type) VALUES(6, 10010203, 0);"]
[6,{"$f":"菜单!A14","v":10010300},{"$f":"菜单!E14","v":"基础资料/教师信息"},"INSERT INTO sys_role_menu(sys_role_id, sys_menu_id, data_scope_type) VALUES(6, 10010300, 0);"]
[6,{"$f":"菜单!A15","v":10010301},{"$f":"菜单!E15","v":"基础资料/教师信息/添加"},"INSERT INTO sys_role_menu(sys_role_id, sys_menu_id, data_scope_type) VALUES(6, 10010301, 0);"]
[6,{"$f":"菜单!A16","v":10010302},{"$f":"菜单!E16","v":"基础资料/教师信息/修改"},"INSERT INTO sys_role_menu(sys_role_id, sys_menu_id, data_scope_type) VALUES(6, 10010302, 0);"]
[6,{"$f":"菜单!A17","v":10010303},{"$f":"菜单!E17","v":"基础资料/教师信息/删除"},"INSERT INTO sys_role_menu(sys_role_id, sys_menu_id, data_scope_type) VALUES(6, 10010303, 0);"]
{"$rows_left_out":109}
{"sheet":"审核角色","index":3,"n_rows":42,"n_cols":4,"rows_kept":42,"cut":false,"hidden":false,"merged":[]}
["sys_role_id","sys_menu_id","sys_menu_name"]
[null,null,null,"/* 小学特殊学生审核角色菜单权限 */"]
[3,{"$f":"菜单!A2","v":10000000},{"$f":"菜单!E2","v":"工作台"},{"$f":"\"INSERT INTO sys_role_menu(sys_role_id, sys_menu_id, data_scope_type) VALUES(\"&A3&\", \"&B3&\", 0);\"","v":"INSERT INTO sys_role_menu(sys_role_id, sys_menu_id, data_scope_type) VALUES(3, 10000000, 0);"}]
[3,{"$f":"菜单!A24","v":10020000},{"$f":"菜单!E24","v":"监测管理"},{"$f":"\"INSERT INTO sys_role_menu(sys_role_id, sys_menu_id, data_scope_type) VALUES(\"&A4&\", \"&B4&\", 0);\"","v":"INSERT INTO sys_role_menu(sys_role_id, sys_menu_id, data_scope_type) VALUES(3, 10020000, 0);"}]
[3,{"$f":"菜单!A51","v":10020600},{"$f":"菜单!E51","v":"监测管理/特殊学生申报审核"},{"$f":"\"INSERT INTO sys_role_menu(sys_role_id, sys_menu_id, data_scope_type) VALUES(\"&A5&\", \"&B5&\", 0);\"","v":"INSERT INTO sys_role_menu(sys_role_id, sys_menu_id, data_scope_type) VALUES(3, 10020600, 0);"}]
[3,{"$f":"菜单!A52","v":10020601},{"$f":"菜单!E52","v":"监测管理/特殊学生申报审核/添加"},"INSERT INTO sys_role_menu(sys_role_id, sys_menu_id, data_scope_type) VALUES(3, 10020601, 0);"]
[3,{"$f":"菜单!A53","v":10020602},{"$f":"菜单!E53","v":"监测管理/特殊学生申报审核/修改"},"INSERT INTO sys_role_menu(sys_role_id, sys_menu_id, data_scope_type) VALUES(3, 10020602, 0);"]
[3,{"$f":"菜单!A54","v":10020603},{"$f":"菜单!E54","v":"监测管理/特殊学生申报审核/删除"},"INSERT INTO sys_role_menu(sys_role_id, sys_menu_id, data_scope_type) VALUES(3, 10020603, 0);"]
[3,{"$f":"菜单!A55","v":10020604},{"$f":"菜单!E55","v":"监测管理/特殊学生申报审核/提交"},"INSERT INTO sys_role_menu(sys_role_id, sys_menu_id, data_scope_type) VALUES(3, 10020604, 0);"]
[3,{"$f":"菜单!A56","v":10020605},{"$f":"菜单!E56","v":"监测管理/特殊学生申报审核/审核"},"INSERT INTO sys_role_menu(sys_role_id, sys_menu_id, data_scope_type) VALUES(3, 10020605, 0);"]
[3,{"$f":"菜单!A57","v":10020606},{"$f":"菜单!E57","v":"监测管理/特殊学生申报审核/下载"},"INSERT INTO sys_role_menu(sys_role_id, sys_menu_id, data_scope_type) VALUES(3, 10020606, 0);"]
[null,null,null,"/* 小学缺测替补审核角色菜单权限 */"]
[4,{"$f":"菜单!A2","v":10000000},{"$f":"菜单!E2","v":"工作台"},{"$f":"\"INSERT INTO sys_role_menu(sys_role_id, sys_menu_id, data_scope_type) VALUES(\"&A13&\", \"&B13&\", 0);\"","v":"INSERT INTO sys_role_menu(sys_role_id, sys_menu_id, data_scope_type) VALUES(4, 10000000, 0);"}]
[4,{"$f":"菜单!A24","v":10020000},{"$f":"菜单!E24","v":"监测管理"},{"$f":"\"INSERT INTO sys_role_menu(sys_role_id, sys_menu_id, data_scope_type) VALUES(\"&A14&\", \"&B14&\", 0);\"","v":"INSERT INTO sys_role_menu(sys_role_id, sys_menu_id, data_scope_type) VALUES(4, 10020000, 0);"}]
[4,{"$f":"菜单!A58","v":10020700},{"$f":"菜单!E58","v":"监测管理/缺测替补学生审核"},{"$f":"\"INSERT INTO sys_role_menu(sys_role_id, sys_menu_id, data_scope_type) VALUES(\"&A15&\", \"&B15&\", 0);\"","v":"INSERT INTO sys_role_menu(sys_role_id, sys_menu_id, data_scope_type) VALUES(4, 10020700, 0);"}]
{"$rows_left_out":28}
{"sheet":"双向细目表角色","index":4,"n_rows":18,"n_cols":4,"rows_kept":18,"cut":false,"hidden":false,"merged":[]}
["sys_role_id","sys_menu_id","sys_menu_name"]
[11,{"$f":"菜单!A2","v":10000000},{"$f":"菜单!E2","v":"工作台"},{"$f":"\"INSERT INTO sys_role_menu(sys_role_id, sys_menu_id, data_scope_type) VALUES(\"&A2&\", \"&B2&\", 0);\"","v":"INSERT INTO sys_role_menu(sys_role_id, sys_menu_id, data_scope_type) VALUES(11, 10000000, 0);"}]
[11,{"$f":"菜单!A24","v":10020000},{"$f":"菜单!E24","v":"监测管理"},{"$f":"\"INSERT INTO sys_role_menu(sys_role_id, sys_menu_id, data_scope_type) VALUES(\"&A3&\", \"&B3&\", 0);\"","v":"INSERT INTO sys_role_menu(sys_role_id, sys_menu_id, data_scope_type) VALUES(11, 10020000, 0);"}]
[11,{"$f":"菜单!A83","v":10025000},{"$f":"菜单!E83","v":"监测管理/双向细目表编制"},{"$f":"\"INSERT INTO sys_role_menu(sys_role_id, sys_menu_id, data_scope_type) VALUES(\"&A4&\", \"&B4&\", 0);\"","v":"INSERT INTO sys_role_menu(sys_role_id, sys_menu_id, data_scope_type) VALUES(11, 10025000, 0);"}]
[11,{"$f":"菜单!A84","v":10025001},{"$f":"菜单!E84","v":"监测管理/双向细目表编制/添加"},{"$f":"\"INSERT INTO sys_role_menu(sys_role_id, sys_menu_id, data_scope_type) VALUES(\"&A5&\", \"&B5&\", 0);\"","v":"INSERT INTO sys_role_menu(sys_role_id, sys_menu_id, data_scope_type) VALUES(11, 10025001, 0);"}]
[11,{"$f":"菜单!A85","v":10025002},{"$f":"菜单!E85","v":"监测管理/双向细目表编制/修改"},{"$f":"\"INSERT INTO sys_role_menu(sys_role_id, sys_menu_id, data_scope_type) VALUES(\"&A6&\", \"&B6&\", 0);\"","v":"INSERT INTO sys_role_menu(sys_role_id, sys_menu_id, data_scope_type) VALUES(11, 10025002, 0);"}]
[11,{"$f":"菜单!A86","v":10025003},{"$f":"菜单!E86","v":"监测管理/双向细目表编制/删除"},{"$f":"\"INSERT INTO sys_role_menu(sys_role_id, sys_menu_id, data_scope_type) VALUES(\"&A7&\", \"&B7&\", 0);\"","v":"INSERT INTO sys_role_menu(sys_role_id, sys_menu_id, data_scope_type) VALUES(11, 10025003, 0);"}]
[11,{"$f":"菜单!A87","v":10025004},{"$f":"菜单!E87","v":"监测管理/双向细目表编制/审核"},"INSERT INTO sys_role_menu(sys_role_id, sys_menu_id, data_scope_type) VALUES(11, 10025004, 0);"]
[11,{"$f":"菜单!A88","v":10025005},{"$f":"菜单!E88","v":"监测管理/双向细目表编制/导出"},"INSERT INTO sys_role_menu(sys_role_id, sys_menu_id, data_scope_type) VALUES(11, 10025005, 0);"]
[]
[12,{"$f":"菜单!A2","v":10000000},{"$f":"菜单!E2","v":"工作台"},"INSERT INTO sys_role_menu(sys_role_id, sys_menu_id, data_scope_type) VALUES(12, 10000000, 0);"]
[12,{"$f":"菜单!A24","v":10020000},{"$f":"菜单!E24","v":"监测管理"},"INSERT INTO sys_role_menu(sys_role_id, sys_menu_id, data_scope_type) VALUES(12, 10020000, 0);"]
[12,{"$f":"菜单!A89","v":10025100},{"$f":"菜单!E89","v":"监测管理/学科问题建议撰写"},{"$f":"\"INSERT INTO sys_role_menu(sys_role_id, sys_menu_id, data_scope_type) VALUES(\"&A13&\", \"&B13&\", 0);\"","v":"INSERT INTO sys_role_menu(sys_role_id, sys_menu_id, data_scope_type) VALUES(12, 10025100, 0);"}]
[12,{"$f":"菜单!A90","v":10025101},{"$f":"菜单!E90","v":"监测管理/学科问题建议撰写/添加"},"INSERT INTO sys_role_menu(sys_role_id, sys_menu_id, data_scope_type) VALUES(12, 10025101, 0);"]
[12,{"$f":"菜单!A91","v":10025102},{"$f":"菜单!E91","v":"监测管理/学科问题建议撰写/修改"},"INSERT INTO sys_role_menu(sys_role_id, sys_menu_id, data_scope_type) VALUES(12, 10025102, 0);"]
{"$rows_left_out":4}
{"sheet":"枚举","index":5,"n_rows":4,"n_cols":5,"rows_kept":4,"cut":false,"hidden":false,"merged":[]}
["MenuType.FOLDER",1,null,"MenuOpenType.NONE",1]
["MenuType.MENU",2,null,"MenuOpenType.COMPONENT",2]
["MenuType.BUTTON",3,null,"MenuOpenType.INNER",3]
[null,null,null,"MenuOpenType.OUTER",4]