{"text_format":"2","workbook":"xlsx","n_sheets":5,"sheets":["智学网学校名称","区测系统学校名称","Sheet3","Sheet1","Sheet2"],"not_rendered":{"charts":0,"images":0,"macros":0,"external_links":0,"defined_names":0,"comments":0,"pivot_tables":0},"unopened":[],"bounds":{"document_bytes":16777216,"sheet_cells":100000,"run_cost":"one","rows_first":2000,"rows_last":500,"rows_between":2000,"halvings":0,"cell_chars":16384,"cell_head_chars":4096},"cells_cut":0,"cells_raw":0,"read":"whole","date_system":"1900"}

{"sheet":"智学网学校名称","index":0,"n_rows":98,"n_cols":7,"rows_kept":98,"cut":false,"hidden":false,"merged":[]}
["学段","名称","CC_ID","CC_代码","CC_名称","CC_全称"]
["初中","两江中学",{"$f":"VLOOKUP($B2,Sheet3!$A:$I,2,FALSE)","v":1518},{"$f":"VLOOKUP($B2,Sheet3!$A:$I,6,FALSE)","v":"128"},{"$f":"VLOOKUP($B2,Sheet3!$A:$I,4,FALSE)","v":"两江中学（初中）"},{"$f":"VLOOKUP($B2,Sheet3!$A:$I,5,FALSE)","v":"重庆市两江中学校（初中）"},{"$f":"\"{ \"\"\"&B2&\"\"\", new(){ Id = \"&C2&\", Code = \"\"\"&D2&\"\"\", Name = \"\"\"&E2&\"\"\", FullName = \"\"\"&F2&\"\"\" } },\"","v":"{ \"两江中学\", new(){ Id = 1518, Code = \"128\", Name = \"两江中学（初中）\", FullName = \"重庆市两江中学校（初中）\" } },"}]
["初中","仁睦中学",{"$f":"VLOOKUP($B3,Sheet3!$A:$I,2,FALSE)","v":1512},{"$f":"VLOOKUP($B3,Sheet3!$A:$I,6,FALSE)","v":"119"},{"$f":"VLOOKUP(B3,Sheet3!A:I,4,FALSE)","v":"仁睦中学"},{"$f":"VLOOKUP($B3,Sheet3!$A:$I,5,FALSE)","v":"重庆市渝北区仁睦初级中学校"},{"$f":"\"{ \"\"\"&B3&\"\"\", new(){ Id = \"&C3&\", Code = \"\"\"&D3&\"\"\", Name = \"\"\"&E3&\"\"\", FullName = \"\"\"&F3&\"\"\" } },\"","v":"{ \"仁睦中学\", new(){ Id = 1512, Code = \"119\", Name = \"仁睦中学\", FullName = \"重庆市渝北区仁睦初级中学校\" } },"}]
["初中","大湾中学",{"$f":"VLOOKUP($B4,Sheet3!$A:$I,2,FALSE)","v":1519},{"$f":"VLOOKUP($B4,Sheet3!$A:$I,6,FALSE)","v":"129"},{"$f":"VLOOKUP(B4,Sheet3!A:I,4,FALSE)","v":"大湾中学"},{"$f":"VLOOKUP($B4,Sheet3!$A:$I,5,FALSE)","v":"重庆市渝北区大湾初级中学校"},"{ \"大湾中学\", new(){ Id = 1519, Code = \"129\", Name = \"大湾中学\", FullName = \"重庆市渝北区大湾初级中学校\" } },"]
["初中","大盛中学",{"$f":"VLOOKUP($B5,Sheet3!$A:$I,2,FALSE)","v":1526},{"$f":"VLOOKUP($B5,Sheet3!$A:$I,6,FALSE)","v":"152"},{"$f":"VLOOKUP(B5,Sheet3!A:I,4,FALSE)","v":"大盛学校（初中）"},{"$f":"VLOOKUP($B5,Sheet3!$A:$I,5,FALSE)","v":"重庆市渝北区大盛学校（初中）"},"{ \"大盛中学\", new(){ Id = 1526, Code = \"152\", Name = \"大盛学校（初中）\", FullName = \"重庆市渝北区大盛学校（初中）\" } },"]
["初中","实验二中",{"$f":"VLOOKUP($B6,Sheet3!$A:$I,2,FALSE)","v":1511},{"$f":"VLOOKUP($B6,Sheet3!$A:$I,6,FALSE)","v":"118"},{"$f":"VLOOKUP(B6,Sheet3!A:I,4,FALSE)","v":"实验二中"},{"$f":"VLOOKUP($B6,Sheet3!$A:$I,5,FALSE)","v":"重庆市渝北区第二实验中学校"},"{ \"实验二中\", new(){ Id = 1511, Code = \"118\", Name = \"实验二中\", FullName = \"重庆市渝北区第二实验中学校\" } },"]
["初中","悦来中学",{"$f":"VLOOKUP($B7,Sheet3!$A:$I,2,FALSE)","v":1510},{"$f":"VLOOKUP($B7,Sheet3!$A:$I,6,FALSE)","v":"117"},{"$f":"VLOOKUP(B7,Sheet3!A:I,4,FALSE)","v":"悦来中学"},{"$f":"VLOOKUP($B7,Sheet3!$A:$I,5,FALSE)","v":"重庆市渝北区悦来初级中学校"},"{ \"悦来中学\", new(){ Id = 1510, Code = \"117\", Name = \"悦来中学\", FullName = \"重庆市渝北区悦来初级中学校\" } },"]
["初中","悦港中学初中",{"$f":"VLOOKUP($B8,Sheet3!$A:$I,2,FALSE)","v":1527},{"$f":"VLOOKUP($B8,Sheet3!$A:$I,6,FALSE)","v":"155"},{"$f":"VLOOKUP(B8,Sheet3!A:I,4,FALSE)","v":"悦港中学"},{"$f":"VLOOKUP($B8,Sheet3!$A:$I,5,FALSE)","v":"重庆市渝北区悦港初级中学校"},"{ \"悦港中学初中\", new(){ Id = 1527, Code = \"155\", Name = \"悦港中学\", FullName = \"重庆市渝北区悦港初级中学校\" } },"]
["初中","暨华中学高中",{"$f":"VLOOKUP($B9,Sheet3!$A:$I,2,FALSE)","v":1515},{"$f":"VLOOKUP($B9,Sheet3!$A:$I,6,FALSE)","v":"124"},{"$f":"VLOOKUP(B9,Sheet3!A:I,4,FALSE)","v":"暨华中学（初中）"},{"$f":"VLOOKUP($B9,Sheet3!$A:$I,5,FALSE)","v":"重庆市暨华中学校（初中）"},"{ \"暨华中学高中\", new(){ Id = 1515, Code = \"124\", Name = \"暨华中学（初中）\", FullName = \"重庆市暨华中学校（初中）\" } },"]
["初中","洛碛中学",{"$f":"VLOOKUP($B10,Sheet3!$A:$I,2,FALSE)","v":1523},{"$f":"VLOOKUP($B10,Sheet3!$A:$I,6,FALSE)","v":"143"},{"$f":"VLOOKUP(B10,Sheet3!A:I,4,FALSE)","v":"洛碛中学"},{"$f":"VLOOKUP($B10,Sheet3!$A:$I,5,FALSE)","v":"重庆市渝北区洛碛初级中学校"},"{ \"洛碛中学\", new(){ Id = 1523, Code = \"143\", Name = \"洛碛中学\", FullName = \"重庆市渝北区洛碛初级中学校\" } },"]
["初中","渝汉中学",{"$f":"VLOOKUP($B11,Sheet3!$A:$I,2,FALSE)","v":1506},{"$f":"VLOOKUP($B11,Sheet3!$A:$I,6,FALSE)","v":"110"},{"$f":"VLOOKUP(B11,Sheet3!A:I,4,FALSE)","v":"渝汉中学"},{"$f":"VLOOKUP($B11,Sheet3!$A:$I,5,FALSE)","v":"重庆市渝北区渝汉初级中学校"},"{ \"渝汉中学\", new(){ Id = 1506, Code = \"110\", Name = \"渝汉中学\", FullName = \"重庆市渝北区渝汉初级中学校\" } },"]
["初中","玉峰山中学",{"$f":"VLOOKUP($B12,Sheet3!$A:$I,2,FALSE)","v":1520},{"$f":"VLOOKUP($B12,Sheet3!$A:$I,6,FALSE)","v":"134"},{"$f":"VLOOKUP(B12,Sheet3!A:I,4,FALSE)","v":"玉峰山中学"},{"$f":"VLOOKUP($B12,Sheet3!$A:$I,5,FALSE)","v":"重庆市渝北区玉峰山初级中学校"},"{ \"玉峰山中学\", new(){ Id = 1520, Code = \"134\", Name = \"玉峰山中学\", FullName = \"重庆市渝北区玉峰山初级中学校\" } },"]
["初中","王家学校",{"$f":"VLOOKUP($B13,Sheet3!$A:$I,2,FALSE)","v":1521},{"$f":"VLOOKUP($B13,Sheet3!$A:$I,6,FALSE)","v":"135"},{"$f":"VLOOKUP(B13,Sheet3!A:I,4,FALSE)","v":"王家学校（初中）"},{"$f":"VLOOKUP($B13,Sheet3!$A:$I,5,FALSE)","v":"重庆市渝北区王家学校（初中）"},"{ \"王家学校\", new(){ Id = 1521, Code = \"135\", Name = \"王家学校（初中）\", FullName = \"重庆市渝北区王家学校（初中）\" } },"]
["初中","统景中学",{"$f":"VLOOKUP($B14,Sheet3!$A:$I,2,FALSE)","v":1525},{"$f":"VLOOKUP($B14,Sheet3!$A:$I,6,FALSE)","v":"149"},{"$f":"VLOOKUP(B14,Sheet3!A:I,4,FALSE)","v":"统景中学"},{"$f":"VLOOKUP($B14,Sheet3!$A:$I,5,FALSE)","v":"重庆市渝北区统景初级中学校"},"{ \"统景中学\", new(){ Id = 1525, Code = \"149\", Name = \"统景中学\", FullName = \"重庆市渝北区统景初级中学校\" } },"]
["初中","重庆市华蓥中学校",{"$f":"VLOOKUP($B15,Sheet3!$A:$I,2,FALSE)","v":1503},{"$f":"VLOOKUP($B15,Sheet3!$A:$I,6,FALSE)","v":"106"},{"$f":"VLOOKUP(B15,Sheet3!A:I,4,FALSE)","v":"华蓥中学（初中）"},{"$f":"VLOOKUP($B15,Sheet3!$A:$I,5,FALSE)","v":"重庆市华蓥中学校（初中）"},"{ \"重庆市华蓥中学校\", new(){ Id = 1503, Code = \"106\", Name = \"华蓥中学（初中）\", FullName = \"重庆市华蓥中学校（初中）\" } },"]
["初中","重庆市南华中学校",{"$f":"VLOOKUP($B16,Sheet3!$A:$I,2,FALSE)","v":1516},{"$f":"VLOOKUP($B16,Sheet3!$A:$I,6,FALSE)","v":"125"},{"$f":"VLOOKUP(B16,Sheet3!A:I,4,FALSE)","v":"南华中学（初中）"},{"$f":"VLOOKUP($B16,Sheet3!$A:$I,5,FALSE)","v":"重庆市南华中学校（初中）"},"{ \"重庆市南华中学校\", new(){ Id = 1516, Code = \"125\", Name = \"南华中学（初中）\", FullName = \"重庆市南华中学校（初中）\" } },"]
["初中","重庆市松树桥中学校",{"$f":"VLOOKUP($B17,Sheet3!$A:$I,2,FALSE)","v":1514},{"$f":"VLOOKUP($B17,Sheet3!$A:$I,6,FALSE)","v":"123"},{"$f":"VLOOKUP(B17,Sheet3!A:I,4,FALSE)","v":"松树桥中学（初中）"},{"$f":"VLOOKUP($B17,Sheet3!$A:$I,5,FALSE)","v":"重庆市松树桥中学校（初中）"},"{ \"重庆市松树桥中学校\", new(){ Id = 1514, Code = \"123\", Name = \"松树桥中学（初中）\", FullName = \"重庆市松树桥中学校（初中）\" } },"]
["初中","重庆市渝北中学校",{"$f":"VLOOKUP($B18,Sheet3!$A:$I,2,FALSE)","v":1517},{"$f":"VLOOKUP($B18,Sheet3!$A:$I,6,FALSE)","v":"126"},{"$f":"VLOOKUP(B18,Sheet3!A:I,4,FALSE)","v":"渝北中学（初中）"},{"$f":"VLOOKUP($B18,Sheet3!$A:$I,5,FALSE)","v":"重庆市渝北中学校（初中）"},"{ \"重庆市渝北中学校\", new(){ Id = 1517, Code = \"126\", Name = \"渝北中学（初中）\", FullName = \"重庆市渝北中学校（初中）\" } },"]
["初中","重庆市渝北区古路学校",{"$f":"VLOOKUP($B19,Sheet3!$A:$I,2,FALSE)","v":1522},{"$f":"VLOOKUP($B19,Sheet3!$A:$I,6,FALSE)","v":"137"},{"$f":"VLOOKUP(B19,Sheet3!A:I,4,FALSE)","v":"古路学校（初中）"},{"$f":"VLOOKUP($B19,Sheet3!$A:$I,5,FALSE)","v":"重庆市渝北区古路学校（初中）"},"{ \"重庆市渝北区古路学校\", new(){ Id = 1522, Code = \"137\", Name = \"古路学校（初中）\", FullName = \"重庆市渝北区古路学校（初中）\" } },"]
["初中","重庆市渝北区实验中学校",{"$f":"VLOOKUP($B20,Sheet3!$A:$I,2,FALSE)","v":1504},{"$f":"VLOOKUP($B20,Sheet3!$A:$I,6,FALSE)","v":"108"},{"$f":"VLOOKUP(B20,Sheet3!A:I,4,FALSE)","v":"实验中学"},{"$f":"VLOOKUP($B20,Sheet3!$A:$I,5,FALSE)","v":"重庆市渝北区实验中学校"},"{ \"重庆市渝北区实验中学校\", new(){ Id = 1504, Code = \"108\", Name = \"实验中学\", FullName = \"重庆市渝北区实验中学校\" } },"]
["初中","重庆市渝北区御临初级中学校",{"$f":"VLOOKUP($B21,Sheet3!$A:$I,2,FALSE)","v":1524},{"$f":"VLOOKUP($B21,Sheet3!$A:$I,6,FALSE)","v":"148"},{"$f":"VLOOKUP(B21,Sheet3!A:I,4,FALSE)","v":"御临中学"},{"$f":"VLOOKUP($B21,Sheet3!$A:$I,5,FALSE)","v":"重庆市渝北区御临初级中学校"},"{ \"重庆市渝北区御临初级中学校\", new(){ Id = 1524, Code = \"148\", Name = \"御临中学\", FullName = \"重庆市渝北区御临初级中学校\" } },"]
["初中","重庆市渝北区渝石初级中学校",{"$f":"VLOOKUP($B22,Sheet3!$A:$I,2,FALSE)","v":1507},{"$f":"VLOOKUP($B22,Sheet3!$A:$I,6,FALSE)","v":"111"},{"$f":"VLOOKUP(B22,Sheet3!A:I,4,FALSE)","v":"渝石中学"},{"$f":"VLOOKUP($B22,Sheet3!$A:$I,5,FALSE)","v":"重庆市渝北区渝石初级中学校"},"{ \"重庆市渝北区渝石初级中学校\", new(){ Id = 1507, Code = \"111\", Name = \"渝石中学\", FullName = \"重庆市渝北区渝石初级中学校\" } },"]
["初中","重庆市渝北区石鞋学校",{"$f":"VLOOKUP($B23,Sheet3!$A:$I,2,FALSE)","v":1513},{"$f":"VLOOKUP($B23,Sheet3!$A:$I,6,FALSE)","v":"121"},{"$f":"VLOOKUP(B23,Sheet3!A:I,4,FALSE)","v":"石鞋学校（初中）"},{"$f":"VLOOKUP($B23,Sheet3!$A:$I,5,FALSE)","v":"重庆市渝北区石鞋学校（初中）"},"{ \"重庆市渝北区石鞋学校\", new(){ Id = 1513, Code = \"121\", Name = \"石鞋学校（初中）\", FullName = \"重庆市渝北区石鞋学校（初中）\" } },"]
["初中","重庆市渝北区空港实验中学校",{"$f":"VLOOKUP($B24,Sheet3!$A:$I,2,FALSE)","v":1532},{"$f":"VLOOKUP($B24,Sheet3!$A:$I,6,FALSE)","v":"176"},{"$f":"VLOOKUP(B24,Sheet3!A:I,4,FALSE)","v":"空港实验中学"},{"$f":"VLOOKUP($B24,Sheet3!$A:$I,5,FALSE)","v":"重庆市渝北区空港实验中学校"},"{ \"重庆市渝北区空港实验中学校\", new(){ Id = 1532, Code = \"176\", Name = \"空港实验中学\", FullName = \"重庆市渝北区空港实验中学校\" } },"]
["初中","重庆市育仁中学校",{"$f":"VLOOKUP($B25,Sheet3!$A:$I,2,FALSE)","v":1502},{"$f":"VLOOKUP($B25,Sheet3!$A:$I,6,FALSE)","v":"105"},{"$f":"VLOOKUP(B25,Sheet3!A:I,4,FALSE)","v":"育仁中学（初中）"},{"$f":"VLOOKUP($B25,Sheet3!$A:$I,5,FALSE)","v":"重庆市育仁中学校（初中）"},"{ \"重庆市育仁中学校\", new(){ Id = 1502, Code = \"105\", Name = \"育仁中学（初中）\", FullName = \"重庆市育仁中学校（初中）\" } },"]
["初中","锦华学校初中",{"$f":"VLOOKUP($B26,Sheet3!$A:$I,2,FALSE)","v":1505},{"$f":"VLOOKUP($B26,Sheet3!$A:$I,6,FALSE)","v":"109"},{"$f":"VLOOKUP(B26,Sheet3!A:I,4,FALSE)","v":"锦华学校（初中）"},{"$f":"VLOOKUP($B26,Sheet3!$A:$I,5,FALSE)","v":"重庆市渝北区锦华学校（初中）"},"{ \"锦华学校初中\", new(){ Id = 1505, Code = \"109\", Name = \"锦华学校（初中）\", FullName = \"重庆市渝北区锦华学校（初中）\" } },"]
["初中","高嘴学校",{"$f":"VLOOKUP($B27,Sheet3!$A:$I,2,FALSE)","v":1501},{"$f":"VLOOKUP($B27,Sheet3!$A:$I,6,FALSE)","v":"104"},{"$f":"VLOOKUP(B27,Sheet3!A:I,4,FALSE)","v":"高嘴学校（初中）"},{"$f":"VLOOKUP($B27,Sheet3!$A:$I,5,FALSE)","v":"重庆市渝北区高嘴学校（初中）"},"{ \"高嘴学校\", new(){ Id = 1501, Code = \"104\", Name = \"高嘴学校（初中）\", FullName = \"重庆市渝北区高嘴学校（初中）\" } },"]
["初中","龙塔学校",{"$f":"VLOOKUP($B28,Sheet3!$A:$I,2,FALSE)","v":1508},{"$f":"VLOOKUP($B28,Sheet3!$A:$I,6,FALSE)","v":"112"},{"$f":"VLOOKUP(B28,Sheet3!A:I,4,FALSE)","v":"龙塔实验学校（初中）"},{"$f":"VLOOKUP($B28,Sheet3!$A:$I,5,FALSE)","v":"重庆市渝北区龙塔实验学校（初中）"},"{ \"龙塔学校\", new(){ Id = 1508, Code = \"112\", Name = \"龙塔实验学校（初中）\", FullName = \"重庆市渝北区龙塔实验学校（初中）\" } },"]
[]
[]
[]
[]
["小学","渝北区古路中心小学校",{"$f":"VLOOKUP($B33,Sheet1!$A:$J,2,FALSE)","v":1034},{"$f":"VLOOKUP($B33,Sheet1!$A:$J,7,FALSE)","v":"037"},{"$f":"VLOOKUP($B33,Sheet1!$A:$J,4,FALSE)","v":"古路学校（小学）"},{"$f":"VLOOKUP($B33,Sheet1!$A:$J,5,FALSE)","v":"重庆市渝北区古路学校（小学）"},{"$f":"\"{ \"\"\"&B33&\"\"\", new(){ Id = \"&C33&\", Code = \"\"\"&D33&\"\"\", Name = \"\"\"&E33&\"\"\", FullName = \"\"\"&F33&\"\"\" } },\"","v":"{ \"渝北区古路中心小学校\", new(){ Id = 1034, Code = \"037\", Name = \"古路学校（小学）\", FullName = \"重庆市渝北区古路学校（小学）\" } },"}]
["小学","渝北区大盛中心小学校",{"$f":"VLOOKUP($B34,Sheet1!$A:$J,2,FALSE)","v":1048},{"$f":"VLOOKUP($B34,Sheet1!$A:$J,7,FALSE)","v":"052"},{"$f":"VLOOKUP($B34,Sheet1!$A:$J,4,FALSE)","v":"大盛学校（小学）"},{"$f":"VLOOKUP($B34,Sheet1!$A:$J,5,FALSE)","v":"重庆市渝北区大盛学校（小学）"},{"$f":"\"{ \"\"\"&B34&\"\"\", new(){ Id = \"&C34&\", Code = \"\"\"&D34&\"\"\", Name = \"\"\"&E34&\"\"\", FullName = \"\"\"&F34&\"\"\" } },\"","v":"{ \"渝北区大盛中心小学校\", new(){ Id = 1048, Code = \"052\", Name = \"大盛学校（小学）\", FullName = \"重庆市渝北区大盛学校（小学）\" } },"}]
["小学","渝北区石鞋小学校",{"$f":"VLOOKUP($B35,Sheet1!$A:$J,2,FALSE)","v":1020},{"$f":"VLOOKUP($B35,Sheet1!$A:$J,7,FALSE)","v":"021"},{"$f":"VLOOKUP($B35,Sheet1!$A:$J,4,FALSE)","v":"石鞋学校（小学）"},{"$f":"VLOOKUP($B35,Sheet1!$A:$J,5,FALSE)","v":"重庆市渝北区石鞋学校（小学）"},"{ \"渝北区石鞋小学校\", new(){ Id = 1020, Code = \"021\", Name = \"石鞋学校（小学）\", FullName = \"重庆市渝北区石鞋学校（小学）\" } },"]
["小学","渝北区金港小学",{"$f":"VLOOKUP($B36,Sheet1!$A:$J,2,FALSE)","v":1030},{"$f":"VLOOKUP($B36,Sheet1!$A:$J,7,FALSE)","v":"032"},{"$f":"VLOOKUP($B36,Sheet1!$A:$J,4,FALSE)","v":"金港国际小学"},{"$f":"VLOOKUP($B36,Sheet1!$A:$J,5,FALSE)","v":"重庆市渝北金港国际实验小学校"},"{ \"渝北区金港小学\", new(){ Id = 1030, Code = \"032\", Name = \"金港国际小学\", FullName = \"重庆市渝北金港国际实验小学校\" } },"]
["小学","渝北实验小学校",{"$f":"VLOOKUP($B37,Sheet1!$A:$J,2,FALSE)","v":1031},{"$f":"VLOOKUP($B37,Sheet1!$A:$J,7,FALSE)","v":"033"},{"$f":"VLOOKUP($B37,Sheet1!$A:$J,4,FALSE)","v":"渝北实验小学"},{"$f":"VLOOKUP($B37,Sheet1!$A:$J,5,FALSE)","v":"重庆市渝北实验小学校"},"{ \"渝北实验小学校\", new(){ Id = 1031, Code = \"033\", Name = \"渝北实验小学\", FullName = \"重庆市渝北实验小学校\" } },"]
["小学","重庆市渝北区东原香山实验小学校",{"$f":"VLOOKUP($B38,Sheet1!$A:$J,2,FALSE)","v":1002},{"$f":"VLOOKUP($B38,Sheet1!$A:$J,7,FALSE)","v":"002"},{"$f":"VLOOKUP($B38,Sheet1!$A:$J,4,FALSE)","v":"东原香山实验小学"},{"$f":"VLOOKUP($B38,Sheet1!$A:$J,5,FALSE)","v":"重庆市渝北东原香山实验小学校"},"{ \"重庆市渝北区东原香山实验小学校\", new(){ Id = 1002, Code = \"002\", Name = \"东原香山实验小学\", FullName = \"重庆市渝北东原香山实验小学校\" } },"]
["小学","重庆市渝北区东和春天实验学校",{"$f":"VLOOKUP($B39,Sheet1!$A:$J,2,FALSE)","v":1017},{"$f":"VLOOKUP($B39,Sheet1!$A:$J,7,FALSE)","v":"018"},{"$f":"VLOOKUP($B39,Sheet1!$A:$J,4,FALSE)","v":"东和春天实验学校"},{"$f":"VLOOKUP($B39,Sheet1!$A:$J,5,FALSE)","v":"重庆市渝北区东和春天实验学校"},"{ \"重庆市渝北区东和春天实验学校\", new(){ Id = 1017, Code = \"018\", Name = \"东和春天实验学校\", FullName = \"重庆市渝北区东和春天实验学校\" } },"]
["小学","重庆市渝北区两江小学校",{"$f":"VLOOKUP($B40,Sheet1!$A:$J,2,FALSE)","v":1028},{"$f":"VLOOKUP($B40,Sheet1!$A:$J,7,FALSE)","v":"030"},{"$f":"VLOOKUP($B40,Sheet1!$A:$J,4,FALSE)","v":"两江小学"},{"$f":"VLOOKUP($B40,Sheet1!$A:$J,5,FALSE)","v":"重庆市渝北区两江小学校"},"{ \"重庆市渝北区两江小学校\", new(){ Id = 1028, Code = \"030\", Name = \"两江小学\", FullName = \"重庆市渝北区两江小学校\" } },"]
{"$rows_left_out":59}
{"sheet":"区测系统学校名称","index":1,"n_rows":119,"n_cols":9,"rows_kept":119,"cut":false,"hidden":false,"merged":[]}
["id",null,"name","full_name","short_name","code","unique_code","tqes_id","tqes_code"]
[1001,"小学","宝圣湖小学","重庆市渝北区宝圣湖小学校","宝圣湖小学","001","X001",16,"X016"]
[1002,"小学","东原香山实验小学","重庆市渝北东原香山实验小学校","东原小学","002","X002",112,"X028"]
[1003,"小学","金鹏小学","重庆市渝北区金鹏小学校","金鹏小学","003","X003",110,"X026"]
[1004,"小学","高嘴学校（小学）","重庆市渝北区高嘴学校（小学）","高嘴小学","004","X004",56,"X130"]
[1005,"小学","回兴小学","重庆市渝北区回兴中心小学校","回兴小学","005","X005",15,"X015"]
[1006,"小学","南方玫瑰城实验小学","重庆市渝北区南方玫瑰城实验小学校","玫瑰小学","006","X006",23,"X023"]
[1007,"小学","实验三小","重庆市渝北区第三实验小学校","实验三小","007","X007",8,"X008"]
[1008,"小学","双湖小学","重庆市渝北区双湖小学校","双湖小学","008","X008",10,"X010"]
[1009,"小学","锦华学校（小学）","重庆市渝北区锦华学校（小学）","锦华学校","009","X009",119,"X036"]
[1010,"小学","旭辉小学","重庆市渝北区旭辉小学校","旭辉小学","010","X010",118,"X034"]
[1011,"小学","龙塔实验学校（小学）","重庆市渝北区龙塔实验学校（小学）","龙塔实验","012","X012",13,"X013"]
[1012,"小学","龙头寺小学","重庆市渝北区龙头寺小学校","龙头寺小学","013","X013",129,"X149"]
[1013,"小学","鲁能巴蜀小学","重庆市渝北区鲁能巴蜀小学校","鲁能巴蜀小学","014","X014",137,"X157"]
[1014,"小学","龙溪小学","重庆市渝北区龙溪小学校","龙溪小学","015","X015",5,"X005"]
[1015,"小学","新牌坊小学","重庆市渝北区新牌坊小学校","牌坊小学","016","X016",9,"X009"]
[1016,"小学","长安锦绣实验小学","重庆市渝北区长安锦绣实验小学校","长安锦绣","017","X017",24,"X024"]
[1017,"小学","东和春天实验学校","重庆市渝北区东和春天实验学校","东和春天","018","X018",7,"X007"]
[1018,"小学","花园小学","重庆市渝北区花园小学校","花园小学","019","X019",12,"X012"]
[1019,"小学","龙山小学","重庆市渝北区龙山小学校","龙山小学","020","X020",25,"X025"]
[1020,"小学","石鞋学校（小学）","重庆市渝北区石鞋学校（小学）","石鞋小学","021","X021",41,"X115"]
[1021,"小学","渝开学校（小学）","重庆市渝北区渝开学校（小学）","渝开学校","022","X022",17,"X017"]
[1022,"小学","天一新城小学","重庆市渝北区天一新城小学校","天一小学","023","X023",18,"X018"]
[1023,"小学","仁睦完小","重庆市渝北区仁睦完全小学校","仁睦完小","025","X025",22,"X022"]
[1024,"小学","长安锦尚小学","重庆市渝北区长安锦尚小学校","长安锦尚","026","X026",124,"X035"]
[1025,"小学","环雅小学","重庆市渝北区环雅小学校","环雅小学","027","X027",125,"X146"]
[1026,"小学","观月小学","重庆市渝北区观月小学校","观月小学","028","X028",122,"X145"]
[1027,"小学","空港实验小学","重庆市渝北区空港实验小学校","空港小学","029","X029",2,"X002"]
[1028,"小学","两江小学","重庆市渝北区两江小学校","两江小学","030","X030",111,"X027"]
[1029,"小学","汉渝路小学","重庆市渝北区汉渝路小学校","汉渝小学","031","X031",3,"X003"]
[1030,"小学","金港国际小学","重庆市渝北金港国际实验小学校","金港小学","032","X032",6,"X006"]
[1031,"小学","渝北实验小学","重庆市渝北实验小学校","实验小学","033","X033",1,"X001"]
[1032,"小学","笃信实验学校","重庆市渝北区笃信实验学校","笃信学校","034","X034",20,"X020"]
[1033,"小学","王家学校（小学）","重庆市渝北区王家学校（小学）","王家学校（小学）","035","X035",26,"X029"]
[1034,"小学","古路学校（小学）","重庆市渝北区古路学校（小学）","古路小学","037","X037",38,"X112"]
[1035,"小学","鹿山小学","重庆市渝北区鹿山小学校","鹿山小学","038","X038",11,"X011"]
[1036,"小学","五星路小学","重庆市渝北区五星路小学校","五星小学","039","X039",4,"X004"]
[1037,"小学","渝北巴蜀小学","重庆市渝北巴蜀小学","巴蜀","040","X040",114,"X030"]
[1038,"小学","空港新城人和街小学","重庆市渝北区空港新城人和街小学","空港人和街","041","X041",116,"X032"]
[1039,"小学","空港新城小学","重庆市渝北区空港新城小学校","空港新城","042","X042",21,"X021"]
{"$rows_left_out":80}
{"sheet":"Sheet3","index":2,"n_rows":37,"n_cols":9,"rows_kept":37,"cut":false,"hidden":false,"merged":[]}
["高嘴学校",1501,"初中","高嘴学校（初中）","重庆市渝北区高嘴学校（初中）","104","C104",99,"C029"]
["重庆市育仁中学校",1502,"初中","育仁中学（初中）","重庆市育仁中学校（初中）","105","C105",77,"C018"]
["重庆市华蓥中学校",1503,"初中","华蓥中学（初中）","重庆市华蓥中学校（初中）","106","C106",76,"C016"]
["重庆市渝北区实验中学校",1504,"初中","实验中学","重庆市渝北区实验中学校","108","C108",78,"C006"]
["锦华学校初中",1505,"初中","锦华学校（初中）","重庆市渝北区锦华学校（初中）","109","C109",86,"C014"]
["渝汉中学",1506,"初中","渝汉中学","重庆市渝北区渝汉初级中学校","110","C110",89,"C019"]
["重庆市渝北区渝石初级中学校",1507,"初中","渝石中学","重庆市渝北区渝石初级中学校","111","C111",91,"C021"]
["龙塔学校",1508,"初中","龙塔实验学校（初中）","重庆市渝北区龙塔实验学校（初中）","112","C112",81,"C009"]
["黄炎中学",1509,"初中","黄炎培中学","重庆市渝北区黄炎培初级中学校","116","C116",82,"C010"]
["悦来中学",1510,"初中","悦来中学","重庆市渝北区悦来初级中学校","117","C117",84,"C012"]
["实验二中",1511,"初中","实验二中","重庆市渝北区第二实验中学校","118","C118",79,"C007"]
["仁睦中学",1512,"初中","仁睦中学","重庆市渝北区仁睦初级中学校","119","C119",88,"C015"]
["重庆市渝北区石鞋学校",1513,"初中","石鞋学校（初中）","重庆市渝北区石鞋学校（初中）","121","C121",113,"C033"]
["重庆市松树桥中学校",1514,"初中","松树桥中学（初中）","重庆市松树桥中学校（初中）","123","C123",73,"C003"]
["暨华中学高中",1515,"初中","暨华中学（初中）","重庆市暨华中学校（初中）","124","C124",72,"C002"]
["重庆市南华中学校",1516,"初中","南华中学（初中）","重庆市南华中学校（初中）","125","C125",74,"C004"]
["重庆市渝北中学校",1517,"初中","渝北中学（初中）","重庆市渝北中学校（初中）","126","C126",71,"C001"]
["两江中学",1518,"初中","两江中学（初中）","重庆市两江中学校（初中）","128","C128",75,"C005"]
["大湾中学",1519,"初中","大湾中学","重庆市渝北区大湾初级中学校","129","C129",98,"C028"]
["玉峰山中学",1520,"初中","玉峰山中学","重庆市渝北区玉峰山初级中学校","134","C134",95,"C025"]
["王家学校",1521,"初中","王家学校（初中）","重庆市渝北区王家学校（初中）","135","C135",85,"C013"]
["重庆市渝北区古路学校",1522,"初中","古路学校（初中）","重庆市渝北区古路学校（初中）","137","C137",96,"C026"]
["洛碛中学",1523,"初中","洛碛中学","重庆市渝北区洛碛初级中学校","143","C143",92,"C022"]
["重庆市渝北区御临初级中学校",1524,"初中","御临中学","重庆市渝北区御临初级中学校","148","C148",94,"C024"]
["统景中学",1525,"初中","统景中学","重庆市渝北区统景初级中学校","149","C149",93,"C023"]
["大盛中学",1526,"初中","大盛学校（初中）","重庆市渝北区大盛学校（初中）","152","C152",100,"C030"]
["悦港中学初中",1527,"初中","悦港中学","重庆市渝北区悦港初级中学校","155","C155",121,"C035"]
["皇冠中学",1528,"初中","皇冠中学","重庆市渝北区皇冠中学校","167","C167",144,"C043"]
["南开两江（初中）",1529,"初中","南开两江（初中）","重庆市渝北区南开两江中学校（初中）","172","C172",138,"C037"]
["一中寄宿中学",1530,"初中","一中寄宿中学","重庆市渝北区一中寄宿学校","174","C174",139,"C038"]
["巴蜀常春藤",1531,"初中","巴蜀常春藤（初中）","重庆市巴蜀常春藤学校（初中）","175","C175",140,"C039"]
["重庆市渝北区空港实验中学校",1532,"初中","空港实验中学","重庆市渝北区空港实验中学校","176","C176",141,"C040"]
["八中渝北龙兴中学",1533,"初中","八中渝北龙兴中学","重庆市八中渝北龙兴中学校","187","C187",142,"C041"]
["重庆八中",1534,"初中","重庆八中（初中）","重庆市第八中学校（初中）","188","C188",143,"C042"]
["数据谷中学",1535,"初中","数据谷中学","重庆市渝北区数据谷中学校","189","C189",128,"C036"]
["哈罗礼德（初中）",1536,"初中","哈罗礼德（初中）","重庆市渝北区哈罗礼德学校（初中）","190","C190",0]
["腾芳中学",1537,"初中","腾芳中学","重庆市渝北区腾芳学校（初中）","191","C191",0]

{"sheet":"Sheet1","index":3,"n_rows":71,"n_cols":10,"rows_kept":71,"cut":false,"hidden":false,"merged":[]}
["重庆市渝北区宝圣湖小学校",1001,"小学","宝圣湖小学","重庆市渝北区宝圣湖小学校","宝圣湖小学","001","X001",16,"X016"]
["重庆市渝北区东原香山实验小学校",1002,"小学","东原香山实验小学","重庆市渝北东原香山实验小学校","东原小学","002","X002",112,"X028"]
["重庆市渝北区金鹏实验小学校",1003,"小学","金鹏小学","重庆市渝北区金鹏小学校","金鹏小学","003","X003",110,"X026"]
["重庆市渝北区高嘴学校",1004,"小学","高嘴学校（小学）","重庆市渝北区高嘴学校（小学）","高嘴小学","004","X004",56,"X130"]
["重庆市渝北区回兴小学校",1005,"小学","回兴小学","重庆市渝北区回兴中心小学校","回兴小学","005","X005",15,"X015"]
["重庆市渝北区南方玫瑰城实验小学校",1006,"小学","南方玫瑰城实验小学","重庆市渝北区南方玫瑰城实验小学校","玫瑰小学","006","X006",23,"X023"]
["重庆市渝北区第三实验小学校",1007,"小学","实验三小","重庆市渝北区第三实验小学校","实验三小","007","X007",8,"X008"]
["重庆市渝北区双湖小学校",1008,"小学","双湖小学","重庆市渝北区双湖小学校","双湖小学","008","X008",10,"X010"]
["重庆市渝北区锦华学校",1009,"小学","锦华学校（小学）","重庆市渝北区锦华学校（小学）","锦华学校","009","X009",119,"X036"]
["重庆市渝北区旭辉小学校",1010,"小学","旭辉小学","重庆市渝北区旭辉小学校","旭辉小学","010","X010",118,"X034"]
["重庆市渝北区龙塔实验学校",1011,"小学","龙塔实验学校（小学）","重庆市渝北区龙塔实验学校（小学）","龙塔实验","012","X012",13,"X013"]
["重庆市渝北区龙头寺小学校",1012,"小学","龙头寺小学","重庆市渝北区龙头寺小学校","龙头寺小学","013","X013",129,"X149"]
["重庆市渝北区鲁能巴蜀小学校",1013,"小学","鲁能巴蜀小学","重庆市渝北区鲁能巴蜀小学校","鲁能巴蜀小学","014","X014",137,"X157"]
["重庆市渝北区龙溪小学校",1014,"小学","龙溪小学","重庆市渝北区龙溪小学校","龙溪小学","015","X015",5,"X005"]
["重庆市渝北区新牌坊小学校",1015,"小学","新牌坊小学","重庆市渝北区新牌坊小学校","牌坊小学","016","X016",9,"X009"]
["重庆市渝北区长安锦绣实验小学校",1016,"小学","长安锦绣实验小学","重庆市渝北区长安锦绣实验小学校","长安锦绣","017","X017",24,"X024"]
["重庆市渝北区东和春天实验学校",1017,"小学","东和春天实验学校","重庆市渝北区东和春天实验学校","东和春天","018","X018",7,"X007"]
["重庆市渝北区花园小学校",1018,"小学","花园小学","重庆市渝北区花园小学校","花园小学","019","X019",12,"X012"]
["重庆市渝北区龙山小学校",1019,"小学","龙山小学","重庆市渝北区龙山小学校","龙山小学","020","X020",25,"X025"]
["渝北区石鞋小学校",1020,"小学","石鞋学校（小学）","重庆市渝北区石鞋学校（小学）","石鞋小学","021","X021",41,"X115"]
["重庆市渝北区渝开学校",1021,"小学","渝开学校（小学）","重庆市渝北区渝开学校（小学）","渝开学校","022","X022",17,"X017"]
["重庆市渝北区天一新城小学校",1022,"小学","天一新城小学","重庆市渝北区天一新城小学校","天一小学","023","X023",18,"X018"]
["重庆市渝北区仁睦完全小学校",1023,"小学","仁睦完小","重庆市渝北区仁睦完全小学校","仁睦完小","025","X025",22,"X022"]
["重庆市渝北区长安锦尚小学校",1024,"小学","长安锦尚小学","重庆市渝北区长安锦尚小学校","长安锦尚","026","X026",124,"X035"]
["重庆市渝北区环雅小学校",1025,"小学","环雅小学","重庆市渝北区环雅小学校","环雅小学","027","X027",125,"X146"]
["重庆市渝北区观月小学校",1026,"小学","观月小学","重庆市渝北区观月小学校","观月小学","028","X028",122,"X145"]
["重庆市渝北区空港实验小学校",1027,"小学","空港实验小学","重庆市渝北区空港实验小学校","空港小学","029","X029",2,"X002"]
["重庆市渝北区两江小学校",1028,"小学","两江小学","重庆市渝北区两江小学校","两江小学","030","X030",111,"X027"]
["重庆市渝北区汉渝路小学校",1029,"小学","汉渝路小学","重庆市渝北区汉渝路小学校","汉渝小学","031","X031",3,"X003"]
["渝北区金港小学",1030,"小学","金港国际小学","重庆市渝北金港国际实验小学校","金港小学","032","X032",6,"X006"]
["渝北实验小学校",1031,"小学","渝北实验小学","重庆市渝北实验小学校","实验小学","033","X033",1,"X001"]
["重庆市渝北区笃信实验学校",1032,"小学","笃信实验学校","重庆市渝北区笃信实验学校","笃信学校","034","X034",20,"X020"]
["重庆市渝北区王家学校",1033,"小学","王家学校（小学）","重庆市渝北区王家学校（小学）","王家学校（小学）","035","X035",26,"X029"]
["渝北区古路中心小学校",1034,"小学","古路学校（小学）","重庆市渝北区古路学校（小学）","古路小学","037","X037",38,"X112"]
["重庆市渝北区鹿山小学校",1035,"小学","鹿山小学","重庆市渝北区鹿山小学校","鹿山小学","038","X038",11,"X011"]
["重庆市渝北区五星路小学校",1036,"小学","五星路小学","重庆市渝北区五星路小学校","五星小学","039","X039",4,"X004"]
["重庆市渝北巴蜀小学",1037,"小学","渝北巴蜀小学","重庆市渝北巴蜀小学校","巴蜀","040","X040",114,"X030"]
["重庆市渝北区空港新城人和街小学校",1038,"小学","空港新城人和街小学","重庆市渝北区空港新城人和街小学校","空港人和街","041","X041",116,"X032"]
["重庆市渝北区空港新城小学校",1039,"小学","空港新城小学","重庆市渝北区空港新城小学校","空港新城","042","X042",21,"X021"]
["重庆市渝北区盛景天下小学校",1040,"小学","盛景天下小学","重庆市渝北区盛景天下小学校","盛景小学","043","X043",115,"X031"]
{"$rows_left_out":32}
{"sheet":"Sheet2","index":4,"n_rows":10,"n_cols":10,"rows_kept":10,"cut":false,"hidden":false,"merged":[]}
[null,1801,"高中","渝北中学（高中）","重庆市渝北中学校（高中）","渝北中学","1","G01",103,"G001"]
["暨华中学高中",1802,"高中","暨华中学（高中）","重庆市暨华中学校（高中）","暨华中学","2","G02",104,"G002"]
["松树桥中学高中",1803,"高中","松树桥中学（高中）","重庆市松树桥中学校（高中）","松树桥中学","3","G03",105,"G003"]
["重庆市南华中学",1804,"高中","南华中学（高中）","重庆市南华中学校（高中）","南华中学","4","G04",106,"G004"]
["两江中学高中",1805,"高中","两江中学（高中）","重庆市两江中学校（高中）","两江中学","5","G05",107,"G005"]
["华蓥中学高中",1806,"高中","华蓥中学（高中）","重庆市华蓥中学校（高中）","华蓥中学","6","G06",108,"G006"]
["育仁中学高中",1807,"高中","育仁中学（高中）","重庆市育仁中学校（高中）","育仁中学","7","G07",109,"G007"]
[null,1808,"高中","重庆八中（高中）","重庆市第八中学校（高中）","重庆八中","8","G08",0]
[null,1809,"高中","巴蜀常春藤（高中）","重庆市巴蜀常春藤学校（高中）","巴蜀常春藤","9","G09",0]
[null,1810,"高中","南开两江（高中）","重庆市渝北区南开两江中学校（高中）","两江南开","10","G10",0]